Reaction Details
TargetTyrosine-protein phosphatase non-receptor type 22
LigandBDBM54791
Substrate/Competitorn/a
Meas. Tech.Dose Response confirmation of uHTS hits from a small molecule inhibitors of LYP via a fluorescence intensity assay - Set 2
IC50 38456±3698 nM
Citation PubChem, PC Dose Response confirmation of uHTS hits from a small molecule inhibitors of LYP via a fluorescence intensity assay - Set 2 PubChem Bioassay(2010)[AID]
 
Tyrosine-protein phosphatase non-receptor type 22
Name:Tyrosine-protein phosphatase non-receptor type 22
Type:n/a
Mol. Mass.:91712.31
Organism:Homo sapiens (Human)
Description:Q9Y2R2
Residue:807
BDBM54791
NameBDBM54791
Synonyms:5-chloranyl-2-methoxy-N-[3-([1,2,4]triazolo[4,3-b]pyridazin-6-yl)phenyl]benzamide MLS000685766 cid_7217786
TypeSmall organic molecule
Emp. Form.C19H14ClN5O2
Mol. Mass.379.8
SMILESCOc1ccc(Cl)cc1C(=O)Nc1cccc(c1)-c1ccc2nncn2n1