Reaction Details
TargetTyrosine-protein phosphatase non-receptor type 22
LigandBDBM74538
Substrate/Competitorn/a
Meas. Tech.Dose Response confirmation of uHTS hits from a small molecule inhibitors of LYP via a fluorescence intensity assay - Set 2
IC50 14971±659 nM
Citation PubChem, PC Dose Response confirmation of uHTS hits from a small molecule inhibitors of LYP via a fluorescence intensity assay - Set 2 PubChem Bioassay(2010)[AID]
 
Tyrosine-protein phosphatase non-receptor type 22
Name:Tyrosine-protein phosphatase non-receptor type 22
Type:n/a
Mol. Mass.:91712.31
Organism:Homo sapiens (Human)
Description:Q9Y2R2
Residue:807
BDBM74538
NameBDBM74538
Synonyms:3-[[1,3-diketo-2-(4-nitrophenyl)isoindoline-5-carbonyl]amino]-4-methyl-benzoic acid 4-methyl-3-[[2-(4-nitrophenyl)-1,3-bis(oxidanylidene)isoindol-5-yl]carbonylamino]benzoic acid 4-methyl-3-[[[2-(4-nitrophenyl)-1,3-dioxo-5-isoindolyl]-oxomethyl]amino]benzoic acid SMR000555144 | cid_2867365
TypeSmall organic molecule
Emp. Form.C23H15N3O7
Mol. Mass.445.3811
SMILESCc1ccc(cc1NC(=O)c1ccc2C(=O)N(C(=O)c2c1)c1ccc(cc1)[N+]([O-])=O)C(O)=O