Reaction Details
TargetTyrosine-protein phosphatase non-receptor type 22
LigandBDBM61758
Substrate/Competitorn/a
Meas. Tech.Dose Response confirmation of uHTS hits from a small molecule inhibitors of LYP via a fluorescence intensity assay - Set 2
IC50 13791±992 nM
Citation PubChem, PC Dose Response confirmation of uHTS hits from a small molecule inhibitors of LYP via a fluorescence intensity assay - Set 2 PubChem Bioassay(2010)[AID]
 
Tyrosine-protein phosphatase non-receptor type 22
Name:Tyrosine-protein phosphatase non-receptor type 22
Type:n/a
Mol. Mass.:91712.31
Organism:Homo sapiens (Human)
Description:Q9Y2R2
Residue:807
BDBM61758
NameBDBM61758
Synonyms:3-[(5Z)-4-keto-5-[2-keto-1-[2-keto-2-(p-anisidino)ethyl]indolin-3-ylidene]-2-thioxo-thiazolidin-3-yl]propionic acid 3-[(5Z)-5-[1-[2-(4-methoxyanilino)-2-oxoethyl]-2-oxoindol-3-ylidene]-4-oxo-2-sulfanylidene-1,3-thiazolidin-3-yl]propanoic acid MLS001083009 cid_1889464
TypeSmall organic molecule
Emp. Form.C23H19N3O6S2
Mol. Mass.497.543
SMILESCOc1ccc(NC(=O)CN2C(=O)\C(=C3/SC(=S)N(CCC(O)=O)C3=O)c3ccccc23)cc1