Reaction Details
TargetImportin subunit alpha-1
LigandBDBM52071
Substrate/Competitorn/a
Meas. Tech.Fluorescence Cell-Free Homogeneous Counterscreen to Identify Inhibitors of the RanGTP-Importin-beta complex.
EC50 3338±n/a nM
Citation PubChem, PC Fluorescence Cell-Free Homogeneous Counterscreen to Identify Inhibitors of the RanGTP-Importin-beta complex. PubChem Bioassay(2010)[AID]
 
Importin subunit alpha-1
Name:Importin subunit alpha-1
Type:Enzyme Catalytic Domain
Mol. Mass.:57852.15
Organism:Homo sapiens (Human)
Description:gi_119609447
Residue:529
BDBM52071
NameBDBM52071
Synonyms:6-Amino-8-(4-isopropoxy-3-methoxy-phenyl)-2-methyl-2,3,8,8a-tetrahydro-1H-isoquinoline-5,7,7-tricarbonitrile 6-amino-8-(4-isopropoxy-3-methoxy-phenyl)-2-methyl-1,3,8,8a-tetrahydroisoquinoline-5,7,7-tricarbonitrile MLS000034945 cid_650713
TypeSmall organic molecule
Emp. Form.C23H25N5O2
Mol. Mass.403.4769
SMILESCOc1cc(ccc1OC(C)C)C1C2CN(C)CCC2=C(C#N)C(=N)C1(C#N)C#N