Reaction Details
TargetImportin subunit alpha-1
LigandBDBM74600
Substrate/Competitorn/a
Meas. Tech.Fluorescence Cell-Free Homogeneous Counterscreen to Identify Inhibitors of the RanGTP-Importin-beta complex.
EC50 861.7±n/a nM
Citation PubChem, PC Fluorescence Cell-Free Homogeneous Counterscreen to Identify Inhibitors of the RanGTP-Importin-beta complex. PubChem Bioassay(2010)[AID]
 
Importin subunit alpha-1
Name:Importin subunit alpha-1
Type:Enzyme Catalytic Domain
Mol. Mass.:57852.15
Organism:Homo sapiens (Human)
Description:gi_119609447
Residue:529
BDBM74600
NameBDBM74600
Synonyms:MLS000041448 N-(1-ethyl-8-methyl-pyrazolo[3,4-b]quinolin-3-yl)picolinamide N-(1-ethyl-8-methylpyrazolo[3,4-b]quinolin-3-yl)pyridine-2-carboxamide cid_665268
TypeSmall organic molecule
Emp. Form.C19H17N5O
Mol. Mass.331.3712
SMILESCCn1nc(NC(=O)c2ccccn2)c2cc3cccc(C)c3nc12