Reaction Details
TargetImportin subunit alpha-1
LigandBDBM74737
Substrate/Competitorn/a
Meas. Tech.Fluorescence Cell-Free Homogeneous Counterscreen to Identify Inhibitors of the RanGTP-Importin-beta complex.
EC50 4983±n/a nM
Citation PubChem, PC Fluorescence Cell-Free Homogeneous Counterscreen to Identify Inhibitors of the RanGTP-Importin-beta complex. PubChem Bioassay(2010)[AID]
 
Importin subunit alpha-1
Name:Importin subunit alpha-1
Type:Enzyme Catalytic Domain
Mol. Mass.:57852.15
Organism:Homo sapiens (Human)
Description:gi_119609447
Residue:529
BDBM74737
NameBDBM74737
Synonyms:5-(4-phenylmethoxyphenyl)-7-(trifluoromethyl)-[1,2,4]triazolo[1,5-a]pyrimidin-2-amine MLS000537373 [5-(4-benzoxyphenyl)-7-(trifluoromethyl)-[1,2,4]triazolo[1,5-a]pyrimidin-2-yl]amine | cid_1265083
TypeSmall organic molecule
Emp. Form.C19H14F3N5O
Mol. Mass.385.3426
SMILESNc1nc2nc(cc(n2n1)C(F)(F)F)-c1ccc(OCc2ccccc2)cc1