Reaction Details
TargetImportin subunit alpha-1
LigandBDBM74999
Substrate/Competitorn/a
Meas. Tech.Fluorescence Cell-Free Homogeneous Counterscreen to Identify Inhibitors of the RanGTP-Importin-beta complex.
EC50>500000±n/a nM
Citation PubChem, PC Fluorescence Cell-Free Homogeneous Counterscreen to Identify Inhibitors of the RanGTP-Importin-beta complex. PubChem Bioassay(2010)[AID]
 
Importin subunit alpha-1
Name:Importin subunit alpha-1
Type:Enzyme Catalytic Domain
Mol. Mass.:57852.15
Organism:Homo sapiens (Human)
Description:gi_119609447
Residue:529
BDBM74999
NameBDBM74999
Synonyms:3-(3-methoxyphenyl)-N-(5-methyl-1,2-oxazol-3-yl)-4,5-dihydro-1,2-oxazole-5-carboxamide 3-(3-methoxyphenyl)-N-(5-methylisoxazol-3-yl)-2-isoxazoline-5-carboxamide MLS000731410 cid_6619783
TypeSmall organic molecule
Emp. Form.C15H15N3O4
Mol. Mass.301.2973
SMILESCOc1cccc(c1)C1=NOC(C1)C(=O)Nc1cc(C)on1