Reaction Details
TargetImportin subunit alpha-1
LigandBDBM75000
Substrate/Competitorn/a
Meas. Tech.Fluorescence Cell-Free Homogeneous Counterscreen to Identify Inhibitors of the RanGTP-Importin-beta complex.
EC50 3768±n/a nM
Citation PubChem, PC Fluorescence Cell-Free Homogeneous Counterscreen to Identify Inhibitors of the RanGTP-Importin-beta complex. PubChem Bioassay(2010)[AID]
 
Importin subunit alpha-1
Name:Importin subunit alpha-1
Type:Enzyme Catalytic Domain
Mol. Mass.:57852.15
Organism:Homo sapiens (Human)
Description:gi_119609447
Residue:529
BDBM75000
NameBDBM75000
Synonyms:2-methoxyethyl-[5-methyl-2-(p-tolyl)pyrazolo[1,5-a]pyrimidin-7-yl]amine N-(2-methoxyethyl)-5-methyl-2-(4-methylphenyl)-7-pyrazolo[1,5-a]pyrimidinamine SMR000278778 | cid_3227938
TypeSmall organic molecule
Emp. Form.C17H20N4O
Mol. Mass.296.3669
SMILESCOCCNc1cc(C)nc2cc(nn12)-c1ccc(C)cc1