Reaction Details
TargetImportin subunit alpha-1
LigandBDBM75002
Substrate/Competitorn/a
Meas. Tech.Fluorescence Cell-Free Homogeneous Counterscreen to Identify Inhibitors of the RanGTP-Importin-beta complex.
EC50>500000±n/a nM
Citation PubChem, PC Fluorescence Cell-Free Homogeneous Counterscreen to Identify Inhibitors of the RanGTP-Importin-beta complex. PubChem Bioassay(2010)[AID]
 
Importin subunit alpha-1
Name:Importin subunit alpha-1
Type:Enzyme Catalytic Domain
Mol. Mass.:57852.15
Organism:Homo sapiens (Human)
Description:gi_119609447
Residue:529
BDBM75002
NameBDBM75002
Synonyms:MLS000720191 N-[[5-(2-chlorophenyl)-2-furanyl]methylideneamino]benzamide N-[[5-(2-chlorophenyl)furan-2-yl]methylideneamino]benzamide cid_761277
TypeSmall organic molecule
Emp. Form.C18H13ClN2O2
Mol. Mass.324.761
SMILESClc1ccccc1-c1ccc(C=NNC(=O)c2ccccc2)o1