Reaction Details
TargetImportin subunit alpha-1
LigandBDBM75007
Substrate/Competitorn/a
Meas. Tech.Fluorescence Cell-Free Homogeneous Counterscreen to Identify Inhibitors of the RanGTP-Importin-beta complex.
EC50>500000±n/a nM
Citation PubChem, PC Fluorescence Cell-Free Homogeneous Counterscreen to Identify Inhibitors of the RanGTP-Importin-beta complex. PubChem Bioassay(2010)[AID]
 
Importin subunit alpha-1
Name:Importin subunit alpha-1
Type:Enzyme Catalytic Domain
Mol. Mass.:57852.15
Organism:Homo sapiens (Human)
Description:gi_119609447
Residue:529
BDBM75007
NameBDBM75007
Synonyms:6-(4-ethyl-1-piperazinyl)-3-[(4-fluorophenyl)methyl]-1H-pyrimidine-2,4-dione 6-(4-ethylpiperazino)-3-(4-fluorobenzyl)uracil SMR000320079 | cid_7080709
TypeSmall organic molecule
Emp. Form.C17H21FN4O2
Mol. Mass.332.3726
SMILESCCN1CCN(CC1)c1cc(=O)n(Cc2ccc(F)cc2)c(=O)[nH]1