Reaction Details
TargetImportin subunit alpha-1
LigandBDBM45650
Substrate/Competitorn/a
Meas. Tech.Fluorescence Cell-Free Homogeneous Counterscreen to Identify Inhibitors of the RanGTP-Importin-beta complex.
EC50>500000±n/a nM
Citation PubChem, PC Fluorescence Cell-Free Homogeneous Counterscreen to Identify Inhibitors of the RanGTP-Importin-beta complex. PubChem Bioassay(2010)[AID]
 
Importin subunit alpha-1
Name:Importin subunit alpha-1
Type:Enzyme Catalytic Domain
Mol. Mass.:57852.15
Organism:Homo sapiens (Human)
Description:gi_119609447
Residue:529
BDBM45650
NameBDBM45650
Synonyms:(3Z)-1-allyl-5-(morpholin-4-ylsulfonyl)-1H-indole-2,3-dione 3-[N-(2-fluorophenyl)thiosemicarbazone] 1-(2-fluorophenyl)-3-[(Z)-(5-morpholin-4-ylsulfonyl-2-oxo-1-prop-2-enylindol-3-ylidene)amino]thiourea 1-[(Z)-(1-allyl-2-keto-5-morpholinosulfonyl-indolin-3-ylidene)amino]-3-(2-fluorophenyl)thiourea SMR000314845 | cid_16194608
TypeSmall organic molecule
Emp. Form.C22H22FN5O4S2
Mol. Mass.503.57
SMILESFc1ccccc1NC(=S)NN=C1C(=O)N(CC=C)c2ccc(cc12)S(=O)(=O)N1CCOCC1