Reaction Details
TargetImportin subunit alpha-1
LigandBDBM75018
Substrate/Competitorn/a
Meas. Tech.Fluorescence Cell-Free Homogeneous Counterscreen to Identify Inhibitors of the RanGTP-Importin-beta complex.
EC50 9013±n/a nM
Citation PubChem, PC Fluorescence Cell-Free Homogeneous Counterscreen to Identify Inhibitors of the RanGTP-Importin-beta complex. PubChem Bioassay(2010)[AID]
 
Importin subunit alpha-1
Name:Importin subunit alpha-1
Type:Enzyme Catalytic Domain
Mol. Mass.:57852.15
Organism:Homo sapiens (Human)
Description:gi_119609447
Residue:529
BDBM75018
NameBDBM75018
Synonyms:3-(2-hydroxyethyl)-2-[(E)-2-(2-methyl-1H-indol-3-yl)ethenyl]-4-quinazolinone 3-(2-hydroxyethyl)-2-[(E)-2-(2-methyl-1H-indol-3-yl)vinyl]quinazolin-4-one SMR000290320 | cid_5732079
TypeSmall organic molecule
Emp. Form.C21H19N3O2
Mol. Mass.345.3945
SMILESCc1[nH]c2ccccc2c1\C=C\c1nc2ccccc2c(=O)n1CCO