Reaction Details
TargetImportin subunit alpha-1
LigandBDBM75019
Substrate/Competitorn/a
Meas. Tech.Fluorescence Cell-Free Homogeneous Counterscreen to Identify Inhibitors of the RanGTP-Importin-beta complex.
EC50>500000±n/a nM
Citation PubChem, PC Fluorescence Cell-Free Homogeneous Counterscreen to Identify Inhibitors of the RanGTP-Importin-beta complex. PubChem Bioassay(2010)[AID]
 
Importin subunit alpha-1
Name:Importin subunit alpha-1
Type:Enzyme Catalytic Domain
Mol. Mass.:57852.15
Organism:Homo sapiens (Human)
Description:gi_119609447
Residue:529
BDBM75019
NameBDBM75019
Synonyms:(1E,4E)-1-(4-chlorophenyl)-5-(dimethylamino)-3-penta-1,4-dienone 1-(4-chlorophenyl)-5-(dimethylamino)-1,4-pentadien-3-one SMR000333528 | cid_5399048
TypeSmall organic molecule
Emp. Form.C13H14ClNO
Mol. Mass.235.709
SMILESCN(C)\C=C\C(=O)\C=C\c1ccc(Cl)cc1