Reaction Details
TargetImportin subunit alpha-1
LigandBDBM75029
Substrate/Competitorn/a
Meas. Tech.Fluorescence Cell-Free Homogeneous Counterscreen to Identify Inhibitors of the RanGTP-Importin-beta complex.
EC50 24040±n/a nM
Citation PubChem, PC Fluorescence Cell-Free Homogeneous Counterscreen to Identify Inhibitors of the RanGTP-Importin-beta complex. PubChem Bioassay(2010)[AID]
 
Importin subunit alpha-1
Name:Importin subunit alpha-1
Type:Enzyme Catalytic Domain
Mol. Mass.:57852.15
Organism:Homo sapiens (Human)
Description:gi_119609447
Residue:529
BDBM75029
NameBDBM75029
Synonyms:MLS000686692 N-phenyl-[1,2,3,4]tetrazolo[1,5-a]quinoxalin-4-amine SMR000339750 phenyl(tetrazolo[1,5-a]quinoxalin-4-yl)amine
TypeSmall organic molecule
Emp. Form.C14H10N6
Mol. Mass.262.2694
SMILESN(c1ccccc1)c1nc2ccccc2n2nnnc12