Reaction Details
TargetImportin subunit alpha-1
LigandBDBM75030
Substrate/Competitorn/a
Meas. Tech.Fluorescence Cell-Free Homogeneous Counterscreen to Identify Inhibitors of the RanGTP-Importin-beta complex.
EC50>500000±n/a nM
Citation PubChem, PC Fluorescence Cell-Free Homogeneous Counterscreen to Identify Inhibitors of the RanGTP-Importin-beta complex. PubChem Bioassay(2010)[AID]
 
Importin subunit alpha-1
Name:Importin subunit alpha-1
Type:Enzyme Catalytic Domain
Mol. Mass.:57852.15
Organism:Homo sapiens (Human)
Description:gi_119609447
Residue:529
BDBM75030
NameBDBM75030
Synonyms:2-(2,6-dimethylmorpholin-4-yl)-5-ethanoyl-6-methyl-pyridine-3-carbonitrile 5-acetyl-2-(2,6-dimethylmorpholin-4-yl)-6-methylpyridine-3-carbonitrile 5-acetyl-2-(2,6-dimethylmorpholino)-6-methylnicotinonitrile SMR000334399 | cid_2769098
TypeSmall organic molecule
Emp. Form.C15H19N3O2
Mol. Mass.273.3303
SMILESCC1CN(CC(C)O1)c1nc(C)c(cc1C#N)C(C)=O