Reaction Details
TargetImportin subunit alpha-1
LigandBDBM53108
Substrate/Competitorn/a
Meas. Tech.Fluorescence Cell-Free Homogeneous Counterscreen to Identify Inhibitors of the RanGTP-Importin-beta complex.
EC50 4529±n/a nM
Citation PubChem, PC Fluorescence Cell-Free Homogeneous Counterscreen to Identify Inhibitors of the RanGTP-Importin-beta complex. PubChem Bioassay(2010)[AID]
 
Importin subunit alpha-1
Name:Importin subunit alpha-1
Type:Enzyme Catalytic Domain
Mol. Mass.:57852.15
Organism:Homo sapiens (Human)
Description:gi_119609447
Residue:529
BDBM53108
NameBDBM53108
Synonyms:2-[(6,7-dihydroxy-2-keto-chromen-4-yl)methylamino]benzoic acid methyl ester MLS001214762 cid_5574594 methyl 2-[[6,7-bis(oxidanyl)-2-oxidanylidene-chromen-4-yl]methylamino]benzoate
TypeSmall organic molecule
Emp. Form.C18H15NO6
Mol. Mass.341.3148
SMILESCOC(=O)c1ccccc1NCc1cc(=O)oc2cc(O)c(O)cc12