Reaction Details
TargetImportin subunit alpha-1
LigandBDBM59056
Substrate/Competitorn/a
Meas. Tech.Fluorescence Cell-Free Homogeneous Counterscreen to Identify Inhibitors of the RanGTP-Importin-beta complex.
EC50 3929±n/a nM
Citation PubChem, PC Fluorescence Cell-Free Homogeneous Counterscreen to Identify Inhibitors of the RanGTP-Importin-beta complex. PubChem Bioassay(2010)[AID]
 
Importin subunit alpha-1
Name:Importin subunit alpha-1
Type:Enzyme Catalytic Domain
Mol. Mass.:57852.15
Organism:Homo sapiens (Human)
Description:gi_119609447
Residue:529
BDBM59056
NameBDBM59056
Synonyms:(3Z)-2-(1,3-dihydrobenzimidazol-2-ylidene)-3-(3-hydroxy-4-keto-cyclohexa-2,5-dien-1-ylidene)propionitrile (3Z)-2-(1,3-dihydrobenzimidazol-2-ylidene)-3-(3-hydroxy-4-oxocyclohexa-2,5-dien-1-ylidene)propanenitrile 2-(1H-Benzoimidazol-2-yl)-3-(3,4-dihydroxy-phenyl)-acrylonitrile SMR000524012 | cid_18772683
TypeSmall organic molecule
Emp. Form.C16H11N3O2
Mol. Mass.277.2774
SMILESOc1ccc(C=C(C#N)c2nc3ccccc3[nH]2)cc1O