Reaction Details
TargetTyrosine-protein phosphatase non-receptor type 22
LigandBDBM35361
Substrate/Competitorn/a
Meas. Tech.Dose Response confirmation of uHTS hits from a small molecule inhibitors of LYP via a fluorescence intensity assay using pCAP substrate
IC50 2393±n/a nM
Citation PubChem, PC Dose Response confirmation of uHTS hits from a small molecule inhibitors of LYP via a fluorescence intensity assay using pCAP substrate PubChem Bioassay(2010)[AID]
 
Tyrosine-protein phosphatase non-receptor type 22
Name:Tyrosine-protein phosphatase non-receptor type 22
Type:n/a
Mol. Mass.:91712.31
Organism:Homo sapiens (Human)
Description:Q9Y2R2
Residue:807
BDBM35361
NameBDBM35361
Synonyms:(5-oxidanidyl-4-thiophen-2-ylcarbonyl-1,2,5-oxadiazol-5-ium-3-yl)-thiophen-2-yl-methanone SMR000034137 [5-oxido-4-(thiophene-2-carbonyl)-1,2,5-oxadiazol-5-ium-3-yl]-thiophen-2-ylmethanone cid_573747
TypeSmall organic molecule
Emp. Form.C12H6N2O4S2
Mol. Mass.306.317
SMILES[O-]n1[o+]nc(C(=O)c2cccs2)c1C(=O)c1cccs1