Reaction Details
TargetTyrosine-protein phosphatase non-receptor type 22
LigandBDBM74457
Substrate/Competitorn/a
Meas. Tech.Dose Response confirmation of uHTS hits from a small molecule inhibitors of LYP via a fluorescence intensity assay using pCAP substrate
IC50>79400±n/a nM
Citation PubChem, PC Dose Response confirmation of uHTS hits from a small molecule inhibitors of LYP via a fluorescence intensity assay using pCAP substrate PubChem Bioassay(2010)[AID]
 
Tyrosine-protein phosphatase non-receptor type 22
Name:Tyrosine-protein phosphatase non-receptor type 22
Type:n/a
Mol. Mass.:91712.31
Organism:Homo sapiens (Human)
Description:Q9Y2R2
Residue:807
BDBM74457
NameBDBM74457
Synonyms:(4-isonicotinoylpiperazino)-(4-pyridyl)methanone MLS000061046 [4-(pyridine-4-carbonyl)piperazin-1-yl]-pyridin-4-ylmethanone cid_706240 | pyridin-4-yl-(4-pyridin-4-ylcarbonylpiperazin-1-yl)methanone
TypeSmall organic molecule
Emp. Form.C16H16N4O2
Mol. Mass.296.3238
SMILESO=C(N1CCN(CC1)C(=O)c1ccncc1)c1ccncc1