Reaction Details
TargetTyrosine-protein phosphatase non-receptor type 22
LigandBDBM74525
Substrate/Competitorn/a
Meas. Tech.Dose Response confirmation of uHTS hits from a small molecule inhibitors of LYP via a fluorescence intensity assay using pCAP substrate
IC50 7654±n/a nM
Citation PubChem, PC Dose Response confirmation of uHTS hits from a small molecule inhibitors of LYP via a fluorescence intensity assay using pCAP substrate PubChem Bioassay(2010)[AID]
 
Tyrosine-protein phosphatase non-receptor type 22
Name:Tyrosine-protein phosphatase non-receptor type 22
Type:n/a
Mol. Mass.:91712.31
Organism:Homo sapiens (Human)
Description:Q9Y2R2
Residue:807
BDBM74525
NameBDBM74525
Synonyms:4-(3-{[[(2E)-2-(1,3-benzodioxol-5-ylmethylene)hydrazino](imino)methyl]thio}-2,5-dioxopyrrolidin-1-yl)benzoic acid 4-[3-[N'-(1,3-benzodioxol-5-ylmethylideneamino)carbamimidoyl]sulfanyl-2,5-bis(oxidanylidene)pyrrolidin-1-yl]benzoic acid 4-[3-[[amino-(1,3-benzodioxol-5-ylmethylidenehydrazinylidene)methyl]thio]-2,5-dioxo-1-pyrrolidinyl]benzoic acid SMR000312892 | cid_3848047
TypeSmall organic molecule
Emp. Form.C20H16N4O6S
Mol. Mass.440.429
SMILESOC(=O)c1ccc(cc1)-n1c(O)cc(SC(=N)NN=Cc2ccc3OCOc3c2)c1O