Reaction Details
TargetTyrosine-protein phosphatase non-receptor type 7
LigandBDBM35361
Substrate/Competitorn/a
Meas. Tech.Dose Response confirmation of HTS hits from an HePTP Fluorescent Assay using OMFP substrate - Set 2
IC50 4500±132 nM
Citation PubChem, PC Dose Response confirmation of HTS hits from an HePTP Fluorescent Assay using OMFP substrate - Set 2 PubChem Bioassay(2010)[AID]
 
Tyrosine-protein phosphatase non-receptor type 7
Name:Tyrosine-protein phosphatase non-receptor type 7
Type:Protein
Mol. Mass.:40530.79
Organism:Homo sapiens (Human)
Description:P35236
Residue:360
BDBM35361
NameBDBM35361
Synonyms:(5-oxidanidyl-4-thiophen-2-ylcarbonyl-1,2,5-oxadiazol-5-ium-3-yl)-thiophen-2-yl-methanone SMR000034137 [5-oxido-4-(thiophene-2-carbonyl)-1,2,5-oxadiazol-5-ium-3-yl]-thiophen-2-ylmethanone cid_573747
TypeSmall organic molecule
Emp. Form.C12H6N2O4S2
Mol. Mass.306.317
SMILES[O-]n1[o+]nc(C(=O)c2cccs2)c1C(=O)c1cccs1