Reaction Details
TargetTyrosine-protein phosphatase non-receptor type 7
LigandBDBM34905
Substrate/Competitorn/a
Meas. Tech.Dose Response confirmation of HTS hits from an HePTP Fluorescent Assay using OMFP substrate - Set 2
IC50<1240±0 nM
Citation PubChem, PC Dose Response confirmation of HTS hits from an HePTP Fluorescent Assay using OMFP substrate - Set 2 PubChem Bioassay(2010)[AID]
 
Tyrosine-protein phosphatase non-receptor type 7
Name:Tyrosine-protein phosphatase non-receptor type 7
Type:Protein
Mol. Mass.:40530.79
Organism:Homo sapiens (Human)
Description:P35236
Residue:360
BDBM34905
NameBDBM34905
Synonyms:1,6-dimethyl-3-propyl-pyrimido[5,4-e][1,2,4]triazine-5,7-dione 1,6-dimethyl-3-propylpyrimido[5,4-e][1,2,4]triazine-5,7-dione SMR000291200 cid_3164059
TypeSmall organic molecule
Emp. Form.C10H13N5O2
Mol. Mass.235.2425
SMILESCCCc1nn(C)c2nc(=O)n(C)c(=O)c2n1