Reaction Details
TargetTyrosine-protein phosphatase non-receptor type 7
LigandBDBM75323
Substrate/Competitorn/a
Meas. Tech.Dose Response confirmation of HTS hits from an HePTP Fluorescent Assay using OMFP substrate - Set 2
IC50<1240±0 nM
Citation PubChem, PC Dose Response confirmation of HTS hits from an HePTP Fluorescent Assay using OMFP substrate - Set 2 PubChem Bioassay(2010)[AID]
 
Tyrosine-protein phosphatase non-receptor type 7
Name:Tyrosine-protein phosphatase non-receptor type 7
Type:Protein
Mol. Mass.:40530.79
Organism:Homo sapiens (Human)
Description:P35236
Residue:360
BDBM75323
NameBDBM75323
Synonyms:2-[4-[[[4-[2-(4-chloroanilino)-1,3-thiazol-4-yl]benzoyl]hydrazinylidene]methyl]phenoxy]acetic acid 2-[4-[[[4-[2-[(4-chlorophenyl)amino]-1,3-thiazol-4-yl]phenyl]carbonylhydrazinylidene]methyl]phenoxy]ethanoic acid MLS000703184 cid_3143384
TypeSmall organic molecule
Emp. Form.C25H19ClN4O4S
Mol. Mass.506.961
SMILESOC(=O)COc1ccc(C=NNC(=O)c2ccc(cc2)-c2csc(Nc3ccc(Cl)cc3)n2)cc1