Reaction Details
TargetTyrosine-protein phosphatase non-receptor type 7
LigandBDBM46244
Substrate/Competitorn/a
Meas. Tech.Dose Response confirmation of HTS hits from an HePTP Fluorescent Assay using OMFP substrate - Set 2
IC50 14604±2704 nM
Citation PubChem, PC Dose Response confirmation of HTS hits from an HePTP Fluorescent Assay using OMFP substrate - Set 2 PubChem Bioassay(2010)[AID]
 
Tyrosine-protein phosphatase non-receptor type 7
Name:Tyrosine-protein phosphatase non-receptor type 7
Type:Protein
Mol. Mass.:40530.79
Organism:Homo sapiens (Human)
Description:P35236
Residue:360
BDBM46244
NameBDBM46244
Synonyms:3-[[(E)-3-[4-(4-chlorobenzyl)oxyphenyl]-2-cyano-acryloyl]amino]benzoic acid 3-[[(E)-3-[4-[(4-chlorophenyl)methoxy]phenyl]-2-cyano-prop-2-enoyl]amino]benzoic acid MLS-0334991.0001 | cid_1516220
TypeSmall organic molecule
Emp. Form.C24H17ClN2O4
Mol. Mass.432.856
SMILESOC(=O)c1cccc(NC(=O)C(=C\c2ccc(OCc3ccc(Cl)cc3)cc2)\C#N)c1