Reaction Details
TargetTyrosine-protein phosphatase non-receptor type 22
LigandBDBM46244
Substrate/Competitorn/a
Meas. Tech.SAR LYP1 Fluorescent Assay using OMFP substrate for In Vitro dose response studies - Set 3
IC50 4740±n/a nM
Citation PubChem, PC SAR LYP1 Fluorescent Assay using OMFP substrate for In Vitro dose response studies - Set 3 PubChem Bioassay(2010)[AID]
 
Tyrosine-protein phosphatase non-receptor type 22
Name:Tyrosine-protein phosphatase non-receptor type 22
Type:n/a
Mol. Mass.:91712.31
Organism:Homo sapiens (Human)
Description:Q9Y2R2
Residue:807
BDBM46244
NameBDBM46244
Synonyms:3-[[(E)-3-[4-(4-chlorobenzyl)oxyphenyl]-2-cyano-acryloyl]amino]benzoic acid 3-[[(E)-3-[4-[(4-chlorophenyl)methoxy]phenyl]-2-cyano-prop-2-enoyl]amino]benzoic acid MLS-0334991.0001 | cid_1516220
TypeSmall organic molecule
Emp. Form.C24H17ClN2O4
Mol. Mass.432.856
SMILESOC(=O)c1cccc(NC(=O)C(=C\c2ccc(OCc3ccc(Cl)cc3)cc2)\C#N)c1