Reaction Details
TargetTyrosine-protein phosphatase non-receptor type 22
LigandBDBM46280
Substrate/Competitorn/a
Meas. Tech.SAR LYP1 Fluorescent Assay using OMFP substrate for In Vitro dose response studies - Set 3
IC50 31700±n/a nM
Citation PubChem, PC SAR LYP1 Fluorescent Assay using OMFP substrate for In Vitro dose response studies - Set 3 PubChem Bioassay(2010)[AID]
 
Tyrosine-protein phosphatase non-receptor type 22
Name:Tyrosine-protein phosphatase non-receptor type 22
Type:n/a
Mol. Mass.:91712.31
Organism:Homo sapiens (Human)
Description:Q9Y2R2
Residue:807
BDBM46280
NameBDBM46280
Synonyms:2-[4-[(Z)-[2-(4-ethylanilino)-4-keto-2-thiazolin-5-ylidene]methyl]phenoxy]acetic acid 2-[4-[(Z)-[2-(4-ethylanilino)-4-oxo-5-thiazolylidene]methyl]phenoxy]acetic acid MLS-0425605.0001 | cid_5765582
TypeSmall organic molecule
Emp. Form.C20H18N2O4S
Mol. Mass.382.433
SMILESCCc1ccc(NC2=NC(=O)C(S2)=Cc2ccc(OCC(O)=O)cc2)cc1