Reaction Details
TargetTyrosine-protein phosphatase non-receptor type 22
LigandBDBM46224
Substrate/Competitorn/a
Meas. Tech.SAR LYP1 Fluorescent Assay using pCAP substrate for In Vitro dose response studies - Set 3
IC50 6740±n/a nM
Citation PubChem, PC SAR LYP1 Fluorescent Assay using pCAP substrate for In Vitro dose response studies - Set 3 PubChem Bioassay(2010)[AID]
 
Tyrosine-protein phosphatase non-receptor type 22
Name:Tyrosine-protein phosphatase non-receptor type 22
Type:n/a
Mol. Mass.:91712.31
Organism:Homo sapiens (Human)
Description:Q9Y2R2
Residue:807
BDBM46224
NameBDBM46224
Synonyms:2-[2-bromanyl-4-[(Z)-[2-[(4-ethylphenyl)amino]-4-oxidanylidene-1,3-thiazol-5-ylidene]methyl]-6-methoxy-phenoxy]ethanoic acid 2-[2-bromo-4-[(Z)-[2-(4-ethylanilino)-4-oxo-1,3-thiazol-5-ylidene]methyl]-6-methoxyphenoxy]acetic acid MLS-0343544.0001 | cid_5765581
TypeSmall organic molecule
Emp. Form.C21H19BrN2O5S
Mol. Mass.491.355
SMILESCCc1ccc(NC2=NC(=O)C(S2)=Cc2cc(Br)c(OCC(O)=O)c(OC)c2)cc1