Reaction Details
TargetTyrosine-protein phosphatase non-receptor type 22
LigandBDBM46266
Substrate/Competitorn/a
Meas. Tech.SAR LYP1 Fluorescent Assay using pCAP substrate for In Vitro dose response studies - Set 3
IC50 30600±n/a nM
Citation PubChem, PC SAR LYP1 Fluorescent Assay using pCAP substrate for In Vitro dose response studies - Set 3 PubChem Bioassay(2010)[AID]
 
Tyrosine-protein phosphatase non-receptor type 22
Name:Tyrosine-protein phosphatase non-receptor type 22
Type:n/a
Mol. Mass.:91712.31
Organism:Homo sapiens (Human)
Description:Q9Y2R2
Residue:807
BDBM46266
NameBDBM46266
Synonyms:2-[2-chloranyl-4-[(E)-[5-(2-chlorophenyl)-6-ethoxycarbonyl-7-methyl-3-oxidanylidene-5H-[1,3]thiazolo[3,2-a]pyrimidin-2-ylidene]methyl]-6-methoxy-phenoxy]ethanoic acid 2-[2-chloro-4-[(E)-[5-(2-chlorophenyl)-6-ethoxycarbonyl-7-methyl-3-oxo-5H-thiazolo[3,2-a]pyrimidin-2-ylidene]methyl]-6-methoxyphenoxy]acetic acid MLS-0425579.0001 | cid_5346285
TypeSmall organic molecule
Emp. Form.C26H22Cl2N2O7S
Mol. Mass.577.433
SMILESCCOC(=O)C1=C(C)N=c2s\c(=C\c3cc(Cl)c(OCC(O)=O)c(OC)c3)c(=O)n2C1c1ccccc1Cl