Reaction Details
TargetTyrosine-protein phosphatase non-receptor type 22
LigandBDBM65966
Substrate/Competitorn/a
Meas. Tech.SAR LYP1 Fluorescent Assay using pCAP substrate for In Vitro dose response studies - Set 3
IC50 44800±n/a nM
Citation PubChem, PC SAR LYP1 Fluorescent Assay using pCAP substrate for In Vitro dose response studies - Set 3 PubChem Bioassay(2010)[AID]
 
Tyrosine-protein phosphatase non-receptor type 22
Name:Tyrosine-protein phosphatase non-receptor type 22
Type:n/a
Mol. Mass.:91712.31
Organism:Homo sapiens (Human)
Description:Q9Y2R2
Residue:807
BDBM65966
NameBDBM65966
Synonyms:2-[4-[(Z)-(2-amino-4-keto-2-thiazolin-5-ylidene)methyl]phenoxy]acetic acid 2-[4-[(Z)-(2-amino-4-oxo-5-thiazolylidene)methyl]phenoxy]acetic acid MLS-0325726.0001 | cid_21229527
TypeSmall organic molecule
Emp. Form.C12H10N2O4S
Mol. Mass.278.284
SMILESNC1=NC(=O)C(S1)=Cc1ccc(OCC(O)=O)cc1