Reaction Details
TargetTyrosine-protein phosphatase non-receptor type 22
LigandBDBM61153
Substrate/Competitorn/a
Meas. Tech.SAR LYP1 Fluorescent Assay using pCAP substrate for In Vitro dose response studies - Set 3
IC50 39000±n/a nM
Citation PubChem, PC SAR LYP1 Fluorescent Assay using pCAP substrate for In Vitro dose response studies - Set 3 PubChem Bioassay(2010)[AID]
 
Tyrosine-protein phosphatase non-receptor type 22
Name:Tyrosine-protein phosphatase non-receptor type 22
Type:n/a
Mol. Mass.:91712.31
Organism:Homo sapiens (Human)
Description:Q9Y2R2
Residue:807
BDBM61153
NameBDBM61153
Synonyms:3-[4-[(5Z)-4-keto-5-(4-methylbenzylidene)-2-thioxo-thiazolidin-3-yl]butanoylamino]benzoic acid 3-[4-[(5Z)-5-[(4-methylphenyl)methylidene]-4-oxo-2-sulfanylidene-1,3-thiazolidin-3-yl]butanoylamino]benzoic acid MLS001034563 cid_1346721
TypeSmall organic molecule
Emp. Form.C22H20N2O4S2
Mol. Mass.440.535
SMILESCc1ccc(\C=C2/SC(=S)N(CCCC(=O)Nc3cccc(c3)C(O)=O)C2=O)cc1