Reaction Details
TargetTyrosine-protein phosphatase non-receptor type 22
LigandBDBM64828
Substrate/Competitorn/a
Meas. Tech.SAR LYP1 Fluorescent Assay using pCAP substrate for In Vitro dose response studies - Set 3
IC50 58500±n/a nM
Citation PubChem, PC SAR LYP1 Fluorescent Assay using pCAP substrate for In Vitro dose response studies - Set 3 PubChem Bioassay(2010)[AID]
 
Tyrosine-protein phosphatase non-receptor type 22
Name:Tyrosine-protein phosphatase non-receptor type 22
Type:n/a
Mol. Mass.:91712.31
Organism:Homo sapiens (Human)
Description:Q9Y2R2
Residue:807
BDBM64828
NameBDBM64828
Synonyms:2-hydroxy-4-[4-[(5Z)-4-keto-2-thioxo-5-veratrylidene-thiazolidin-3-yl]butanoylamino]benzoic acid 4-[4-[(5Z)-5-[(3,4-dimethoxyphenyl)methylidene]-4-oxo-2-sulfanylidene-1,3-thiazolidin-3-yl]butanoylamino]-2-hydroxybenzoic acid MLS-0435437.0001 | cid_6202912
TypeSmall organic molecule
Emp. Form.C23H22N2O7S2
Mol. Mass.502.56
SMILESCOc1ccc(\C=C2/SC(=S)N(CCCC(=O)Nc3ccc(C(O)=O)c(O)c3)C2=O)cc1OC