Reaction Details
TargetTyrosine-protein phosphatase non-receptor type 7
LigandBDBM46246
Substrate/Competitorn/a
Meas. Tech.SAR analysis of compounds that inhibit HePTP - Set 2
IC50 608±n/a nM
Citation PubChem, PC SAR analysis of compounds that inhibit HePTP - Set 2 PubChem Bioassay(2010)[AID]
 
Tyrosine-protein phosphatase non-receptor type 7
Name:Tyrosine-protein phosphatase non-receptor type 7
Type:Protein
Mol. Mass.:40530.79
Organism:Homo sapiens (Human)
Description:P35236
Residue:360
BDBM46246
NameBDBM46246
Synonyms:4-[(5Z)-5-[[5-(1,3-benzothiazol-2-yl)-2-furanyl]methylidene]-4-oxo-2-sulfanylidene-3-thiazolidinyl]butanoic acid 4-[(5Z)-5-[[5-(1,3-benzothiazol-2-yl)furan-2-yl]methylidene]-4-oxidanylidene-2-sulfanylidene-1,3-thiazolidin-3-yl]butanoic acid MLS-0109411.0001 cid_2012947
TypeSmall organic molecule
Emp. Form.C19H14N2O4S3
Mol. Mass.430.52
SMILESOC(=O)CCCN1C(=S)S\C(=C/c2ccc(o2)-c2nc3ccccc3s2)C1=O