Reaction Details
TargetTyrosine-protein phosphatase non-receptor type 7
LigandBDBM46273
Substrate/Competitorn/a
Meas. Tech.SAR analysis of compounds that inhibit HePTP - Set 2
IC50 466±n/a nM
Citation PubChem, PC SAR analysis of compounds that inhibit HePTP - Set 2 PubChem Bioassay(2010)[AID]
 
Tyrosine-protein phosphatase non-receptor type 7
Name:Tyrosine-protein phosphatase non-receptor type 7
Type:Protein
Mol. Mass.:40530.79
Organism:Homo sapiens (Human)
Description:P35236
Residue:360
BDBM46273
NameBDBM46273
Synonyms:2-[2-chloranyl-6-ethoxy-4-[(E)-[2-(naphthalen-2-ylamino)-4-oxidanylidene-1,3-thiazol-5-ylidene]methyl]phenoxy]ethanoic acid 2-[2-chloro-6-ethoxy-4-[(E)-[2-(naphthalen-2-ylamino)-4-oxo-1,3-thiazol-5-ylidene]methyl]phenoxy]acetic acid MLS-0425588.0001 | cid_1228861
TypeSmall organic molecule
Emp. Form.C24H19ClN2O5S
Mol. Mass.482.936
SMILESCCOc1cc(C=C2SC(Nc3ccc4ccccc4c3)=NC2=O)cc(Cl)c1OCC(O)=O