Reaction Details
TargetTyrosine-protein phosphatase non-receptor type 7
LigandBDBM46281
Substrate/Competitorn/a
Meas. Tech.SAR analysis of compounds that inhibit HePTP - Set 2
IC50 1580±n/a nM
Citation PubChem, PC SAR analysis of compounds that inhibit HePTP - Set 2 PubChem Bioassay(2010)[AID]
 
Tyrosine-protein phosphatase non-receptor type 7
Name:Tyrosine-protein phosphatase non-receptor type 7
Type:Protein
Mol. Mass.:40530.79
Organism:Homo sapiens (Human)
Description:P35236
Residue:360
BDBM46281
NameBDBM46281
Synonyms:2-[4-[(Z)-[2-(4-fluoroanilino)-4-keto-2-thiazolin-5-ylidene]methyl]phenoxy]acetic acid methyl ester MLS-0425606.0001 methyl 2-[4-[(Z)-[2-(4-fluoroanilino)-4-oxo-1,3-thiazol-5-ylidene]methyl]phenoxy]acetate | methyl 2-[4-[(Z)-[2-[(4-fluorophenyl)amino]-4-oxidanylidene-1,3-thiazol-5-ylidene]methyl]phenoxy]ethanoate
TypeSmall organic molecule
Emp. Form.C19H15FN2O4S
Mol. Mass.386.397
SMILESCOC(=O)COc1ccc(C=C2SC(Nc3ccc(F)cc3)=NC2=O)cc1