Reaction Details
TargetTyrosine-protein phosphatase non-receptor type 7
LigandBDBM61650
Substrate/Competitorn/a
Meas. Tech.SAR analysis of compounds that inhibit HePTP - Set 2
IC50 1990±n/a nM
Citation PubChem, PC SAR analysis of compounds that inhibit HePTP - Set 2 PubChem Bioassay(2010)[AID]
 
Tyrosine-protein phosphatase non-receptor type 7
Name:Tyrosine-protein phosphatase non-receptor type 7
Type:Protein
Mol. Mass.:40530.79
Organism:Homo sapiens (Human)
Description:P35236
Residue:360
BDBM61650
NameBDBM61650
Synonyms:4-[4-[(5Z)-4-keto-5-piperonylidene-2-thioxo-thiazolidin-3-yl]butanoylamino]benzoic acid 4-[4-[(5Z)-5-(1,3-benzodioxol-5-ylmethylidene)-4-oxo-2-sulfanylidene-1,3-thiazolidin-3-yl]butanoylamino]benzoic acid MLS001083039 cid_2269231
TypeSmall organic molecule
Emp. Form.C22H18N2O6S2
Mol. Mass.470.518
SMILESOC(=O)c1ccc(NC(=O)CCCN2C(=S)S\C(=C/c3ccc4OCOc4c3)C2=O)cc1