Reaction Details
TargetTyrosine-protein phosphatase non-receptor type 7
LigandBDBM65971
Substrate/Competitorn/a
Meas. Tech.SAR analysis of compounds that inhibit HePTP - Set 2
IC50 343±n/a nM
Citation PubChem, PC SAR analysis of compounds that inhibit HePTP - Set 2 PubChem Bioassay(2010)[AID]
 
Tyrosine-protein phosphatase non-receptor type 7
Name:Tyrosine-protein phosphatase non-receptor type 7
Type:Protein
Mol. Mass.:40530.79
Organism:Homo sapiens (Human)
Description:P35236
Residue:360
BDBM65971
NameBDBM65971
Synonyms:3-[[(E)-3-[4-(4-bromobenzyl)oxyphenyl]-2-cyano-acryloyl]amino]benzoic acid 3-[[(E)-3-[4-[(4-bromophenyl)methoxy]phenyl]-2-cyano-prop-2-enoyl]amino]benzoic acid MLS-0336006.0001 | cid_2372242
TypeSmall organic molecule
Emp. Form.C24H17BrN2O4
Mol. Mass.477.307
SMILESOC(=O)c1cccc(NC(=O)C(=C\c2ccc(OCc3ccc(Br)cc3)cc2)\C#N)c1