Reaction Details
TargetTyrosine-protein phosphatase non-receptor type 7
LigandBDBM65975
Substrate/Competitorn/a
Meas. Tech.SAR analysis of compounds that inhibit HePTP - Set 2
IC50 3810±n/a nM
Citation PubChem, PC SAR analysis of compounds that inhibit HePTP - Set 2 PubChem Bioassay(2010)[AID]
 
Tyrosine-protein phosphatase non-receptor type 7
Name:Tyrosine-protein phosphatase non-receptor type 7
Type:Protein
Mol. Mass.:40530.79
Organism:Homo sapiens (Human)
Description:P35236
Residue:360
BDBM65975
NameBDBM65975
Synonyms:3-[[4-[(E)-[3-(3-carboxyphenyl)-4-keto-2-thioxo-thiazolidin-5-ylidene]methyl]-2-chloro-6-methoxy-phenoxy]methyl]benzoic acid 3-[[4-[(E)-[3-(3-carboxyphenyl)-4-oxo-2-sulfanylidene-1,3-thiazolidin-5-ylidene]methyl]-2-chloro-6-methoxyphenoxy]methyl]benzoic acid MLS-0435626.0001 | cid_16466042
TypeSmall organic molecule
Emp. Form.C26H18ClNO7S2
Mol. Mass.556.007
SMILESCOc1cc(\C=C2\SC(=S)N(C2=O)c2cccc(c2)C(O)=O)cc(Cl)c1OCc1cccc(c1)C(O)=O