Reaction Details
TargetTyrosine-protein phosphatase non-receptor type 7
LigandBDBM34452
Substrate/Competitorn/a
Meas. Tech.SAR analysis of compounds that inhibit HePTP - Set 2
IC50 100000±n/a nM
Citation PubChem, PC SAR analysis of compounds that inhibit HePTP - Set 2 PubChem Bioassay(2010)[AID]
 
Tyrosine-protein phosphatase non-receptor type 7
Name:Tyrosine-protein phosphatase non-receptor type 7
Type:Protein
Mol. Mass.:40530.79
Organism:Homo sapiens (Human)
Description:P35236
Residue:360
BDBM34452
NameBDBM34452
Synonyms:(4-amino-3-phenyl-2-sulfanylidene-1,3-thiazol-5-yl)-(4-methylpiperazin-1-yl)methanone (4-amino-3-phenyl-2-thioxo-4-thiazolin-5-yl)-(4-methylpiperazino)methanone 4-amino-5-[(4-methyl-1-piperazinyl)carbonyl]-3-phenyl-1,3-thiazole-2(3H)-thione SMR000072313 | cid_889170
TypeSmall organic molecule
Emp. Form.C15H18N4OS2
Mol. Mass.334.46
SMILESCN1CCN(CC1)C(=O)c1sc(=S)n(c1N)-c1ccccc1