Reaction Details
TargetIntegrin alpha-4
LigandBDBM39009
Substrate/Competitorn/a
Meas. Tech.Dose Response of primary screening hit compounds for Identification of VLA-4 Allosteric Modulators
EC50 2670±n/a nM
Citation PubChem, PC Dose Response of primary screening hit compounds for Identification of VLA-4 Allosteric Modulators PubChem Bioassay(2010)[AID]
 
Integrin alpha-4
Name:Integrin alpha-4
Type:Membrane Protein
Mol. Mass.:114897.35
Organism:Homo sapiens (Human)
Description:P13612
Residue:1032
BDBM39009
NameBDBM39009
Synonyms:6-(4-bromophenyl)-2-(methylsulfinyl)-4-phenylnicotinonitrile 6-(4-bromophenyl)-2-methylsulfinyl-4-phenyl-nicotinonitrile 6-(4-bromophenyl)-2-methylsulfinyl-4-phenylpyridine-3-carbonitrile SMR000073426 | cid_1316704
TypeSmall organic molecule
Emp. Form.C19H13BrN2OS
Mol. Mass.397.288
SMILESCS(=O)c1nc(cc(-c2ccccc2)c1C#N)-c1ccc(Br)cc1