Reaction Details
TargetIntegrin alpha-4
LigandBDBM61070
Substrate/Competitorn/a
Meas. Tech.Dose Response of primary screening hit compounds for Identification of VLA-4 Allosteric Modulators
EC50 7790±n/a nM
Citation PubChem, PC Dose Response of primary screening hit compounds for Identification of VLA-4 Allosteric Modulators PubChem Bioassay(2010)[AID]
 
Integrin alpha-4
Name:Integrin alpha-4
Type:Membrane Protein
Mol. Mass.:114897.35
Organism:Homo sapiens (Human)
Description:P13612
Residue:1032
BDBM61070
NameBDBM61070
Synonyms:(Z)-2-[3-(4-chlorophenyl)-7H-[1,2,4]triazolo[3,4-b][1,3,4]thiadiazin-6-yl]-3-[4-(difluoromethoxy)phenyl]-2-propenoic acid ethyl ester MLS000417101 cid_6217704 ethyl (Z)-3-[4-[bis(fluoranyl)methoxy]phenyl]-2-[3-(4-chlorophenyl)-7H-[1,2,4]triazolo[3,4-b][1,3,4]thiadiazin-6-yl]prop-2-enoate
TypeSmall organic molecule
Emp. Form.C22H17ClF2N4O3S
Mol. Mass.490.91
SMILESCCOC(=O)C(=Cc1ccc(OC(F)F)cc1)C1=Nn2c(SC1)nnc2-c1ccc(Cl)cc1