Reaction Details
TargetIntegrin alpha-4
LigandBDBM75440
Substrate/Competitorn/a
Meas. Tech.Dose Response of primary screening hit compounds for Identification of VLA-4 Allosteric Modulators
EC50 5460±n/a nM
Citation PubChem, PC Dose Response of primary screening hit compounds for Identification of VLA-4 Allosteric Modulators PubChem Bioassay(2010)[AID]
 
Integrin alpha-4
Name:Integrin alpha-4
Type:Membrane Protein
Mol. Mass.:114897.35
Organism:Homo sapiens (Human)
Description:P13612
Residue:1032
BDBM75440
NameBDBM75440
Synonyms:1-[2-[4-[2-(3-methoxyphenyl)-1-benzothiophen-3-yl]phenoxy]ethyl]piperidine MLS002473626 cid_44202269
TypeSmall organic molecule
Emp. Form.C28H29NO2S
Mol. Mass.443.6
SMILESCOc1cccc(c1)-c1sc2ccccc2c1-c1ccc(OCCN2CCCCC2)cc1