Reaction Details
TargetAryl hydrocarbon receptor
LigandBDBM75445
Substrate/Competitorn/a
Meas. Tech.Luminescence-based cell-based high throughput dose response assay for activators of the Aryl Hydrocarbon Receptor (AHR)
EC50 1739±n/a nM
Citation PubChem, PC Luminescence-based cell-based high throughput dose response assay for activators of the Aryl Hydrocarbon Receptor (AHR) PubChem Bioassay(2010)[AID]
 
Aryl hydrocarbon receptor
Name:Aryl hydrocarbon receptor
Type:PROTEIN
Mol. Mass.:96143.77
Organism:Homo sapiens (Human)
Description:ChEMBL_1503828
Residue:848
BDBM75445
NameBDBM75445
Synonyms:3-(5-o-Tolyl-[1,2,4]oxadiazol-3-yl)-pyridine 5-(2-methylphenyl)-3-pyridin-3-yl-1,2,4-oxadiazole MLS000032414 cid_646999
TypeSmall organic molecule
Emp. Form.C14H11N3O
Mol. Mass.237.2566
SMILESCc1ccccc1-c1nc(no1)-c1cccnc1