Reaction Details
TargetAryl hydrocarbon receptor
LigandBDBM75447
Substrate/Competitorn/a
Meas. Tech.Luminescence-based cell-based high throughput dose response assay for activators of the Aryl Hydrocarbon Receptor (AHR)
EC50 2208±n/a nM
Citation PubChem, PC Luminescence-based cell-based high throughput dose response assay for activators of the Aryl Hydrocarbon Receptor (AHR) PubChem Bioassay(2010)[AID]
 
Aryl hydrocarbon receptor
Name:Aryl hydrocarbon receptor
Type:PROTEIN
Mol. Mass.:96143.77
Organism:Homo sapiens (Human)
Description:ChEMBL_1503828
Residue:848
BDBM75447
NameBDBM75447
Synonyms:MLS000031358 N-(2-ethoxyphenyl)quinoxaline-6-carboxamide Quinoxaline-6-carboxylic acid (2-ethoxy-phenyl)-amide cid_649937
TypeSmall organic molecule
Emp. Form.C17H15N3O2
Mol. Mass.293.3199
SMILESCCOc1ccccc1NC(=O)c1ccc2nccnc2c1