Reaction Details
TargetIntestinal-type alkaline phosphatase
LigandBDBM50210
Substrate/Competitorn/a
Meas. Tech.Dose Response concentration confirmation of uHTS hits from a small molecule activators of human intestinal alkaline phosphatase via a luminescent assay
EC50 8300±n/a nM
Citation PubChem, PC Dose Response concentration confirmation of uHTS hits from a small molecule activators of human intestinal alkaline phosphatase via a luminescent assay PubChem Bioassay(2010)[AID]
 
Intestinal-type alkaline phosphatase
Name:Intestinal-type alkaline phosphatase
Type:PROTEIN
Mol. Mass.:56804.94
Organism:Homo sapiens (Human)
Description:ChEMBL_1278525
Residue:528
BDBM50210
NameBDBM50210
Synonyms:4-Methyl-5-oxo-4,5-dihydro-1H-pyrazole-3-carboxylic acid (2,4-dihydroxy-benzylidene)-hydrazide MLS000553611 N'-[(E)-(2-hydroxy-4-oxo-1-cyclohexa-2,5-dienylidene)methyl]-4-methyl-5-oxo-1,4-dihydropyrazole-3-carbohydrazide SMR000171667 | cid_5759606
TypeSmall organic molecule
Emp. Form.C12H12N4O4
Mol. Mass.276.2481
SMILESCc1c([nH][nH]c1=O)C(=O)NN=Cc1ccc(O)cc1O