Reaction Details
TargetIntestinal-type alkaline phosphatase
LigandBDBM75637
Substrate/Competitorn/a
Meas. Tech.Dose Response concentration confirmation of uHTS hits from a small molecule activators of human intestinal alkaline phosphatase via a luminescent assay
EC50 7780±n/a nM
Citation PubChem, PC Dose Response concentration confirmation of uHTS hits from a small molecule activators of human intestinal alkaline phosphatase via a luminescent assay PubChem Bioassay(2010)[AID]
 
Intestinal-type alkaline phosphatase
Name:Intestinal-type alkaline phosphatase
Type:PROTEIN
Mol. Mass.:56804.94
Organism:Homo sapiens (Human)
Description:ChEMBL_1278525
Residue:528
BDBM75637
NameBDBM75637
Synonyms:4-keto-N-(7-quinolylmethyleneamino)-1H-quinazoline-2-carboxamide 4-oxo-N-(7-quinolinylmethylideneamino)-1H-quinazoline-2-carboxamide MLS000775882 cid_5135001
TypeSmall organic molecule
Emp. Form.C19H13N5O2
Mol. Mass.343.3388
SMILESO=C(NN=Cc1ccc2cccnc2c1)c1nc2ccccc2c(=O)[nH]1