Reaction Details
TargetIntestinal-type alkaline phosphatase
LigandBDBM53362
Substrate/Competitorn/a
Meas. Tech.Dose Response concentration confirmation of uHTS hits from a small molecule activators of human intestinal alkaline phosphatase via a luminescent assay
EC50 6810±n/a nM
Citation PubChem, PC Dose Response concentration confirmation of uHTS hits from a small molecule activators of human intestinal alkaline phosphatase via a luminescent assay PubChem Bioassay(2010)[AID]
 
Intestinal-type alkaline phosphatase
Name:Intestinal-type alkaline phosphatase
Type:PROTEIN
Mol. Mass.:56804.94
Organism:Homo sapiens (Human)
Description:ChEMBL_1278525
Residue:528
BDBM53362
NameBDBM53362
Synonyms:MLS001235991 N'-[1-(3,4-dimethylphenyl)pyrazolo[3,4-d]pyrimidin-4-yl]-2-furohydrazide SMR000807176 | cid_8489152
TypeSmall organic molecule
Emp. Form.C18H16N6O2
Mol. Mass.348.3586
SMILESCc1ccc(cc1C)-n1ncc2c(NNC(=O)c3ccco3)ncnc12