Reaction Details
TargetIntestinal-type alkaline phosphatase
LigandBDBM50242280
Substrate/Competitorn/a
Meas. Tech.Dose Response confirmation of uHTS hits from a small molecule inhibitors of human intestinal alkaline phosphatase via a luminescent assay
IC50 3150±n/a nM
Citation PubChem, PC Dose Response confirmation of uHTS hits from a small molecule inhibitors of human intestinal alkaline phosphatase via a luminescent assay PubChem Bioassay(2010)[AID]
 
Intestinal-type alkaline phosphatase
Name:Intestinal-type alkaline phosphatase
Type:PROTEIN
Mol. Mass.:56804.94
Organism:Homo sapiens (Human)
Description:ChEMBL_1278525
Residue:528
BDBM50242280
NameBDBM50242280
Synonyms:(2S,3S,4S,5R,6S)-6-(2-(3,4-dihydroxyphenyl)-5,7-dihydroxy-4-oxo-4H-chromen-3-yloxy)-3,4,5-trihydroxytetrahydro-2H-pyran-2-carboxylic acid Quercetin 3-O-beta-D-glucuronide cid_12004528 | quercetin glucuronide
TypeSmall organic molecule
Emp. Form.C21H18O13
Mol. Mass.478.3598
SMILESO[C@H]1[C@H](Oc2c(O)c3c(cc(O)cc3=O)oc2-c2ccc(O)c(O)c2)O[C@@H]([C@@H](O)[C@@H]1O)C(O)=O