Reaction Details
TargetType-1 angiotensin II receptor
LigandBDBM21629
Substrate/Competitorn/a
Meas. Tech.Dose Response screen for antagonists of Angiotensin II Receptor Type 1 to assess selectivity of uHTS small molecule antagonists hits of the APJ receptor
IC50 2893±751 nM
Citation PubChem, PC Dose Response screen for antagonists of Angiotensin II Receptor Type 1 to assess selectivity of uHTS small molecule antagonists hits of the APJ receptor PubChem Bioassay(2010)[AID]
 
Type-1 angiotensin II receptor
Name:Type-1 angiotensin II receptor
Type:Protein
Mol. Mass.:41080.75
Organism:Homo sapiens (Human)
Description:P30556
Residue:359
BDBM21629
NameBDBM21629
Synonyms:3-(4-methylphenyl)-5H-indeno[1,2-c]pyridazin-5-one cid_2767330
TypeSmall organic molecule
Emp. Form.C18H12N2O
Mol. Mass.272.3007
SMILESCc1ccc(cc1)-c1cc2C(=O)c3ccccc3-c2nn1