Reaction Details
TargetPhotoreceptor-specific nuclear receptor
LigandBDBM42930
Substrate/Competitorn/a
Meas. Tech.TR-FRET-based biochemical high throughput dose response assay to identify NR2E3 inverse agonists
IC50 1173±n/a nM
Citation PubChem, PC TR-FRET-based biochemical high throughput dose response assay to identify NR2E3 inverse agonists PubChem Bioassay(2010)[AID]
 
Photoreceptor-specific nuclear receptor
Name:Photoreceptor-specific nuclear receptor
Type:PROTEIN
Mol. Mass.:44699.83
Organism:Homo sapiens (Human)
Description:ChEMBL_401901
Residue:410
BDBM42930
NameBDBM42930
Synonyms:6-(4-fluorophenyl)-3-methyl-N-(6-methyl-2-pyridinyl)-2-imidazo[2,1-b]thiazolecarboxamide 6-(4-fluorophenyl)-3-methyl-N-(6-methylpyridin-2-yl)imidazo[2,1-b][1,3]thiazole-2-carboxamide SMR000027827 | cid_3240065
TypeSmall organic molecule
Emp. Form.C19H15FN4OS
Mol. Mass.366.412
SMILESCc1c(sc2nc(cn12)-c1ccc(F)cc1)C(=O)Nc1cccc(C)n1