Reaction Details
TargetPhotoreceptor-specific nuclear receptor
LigandBDBM75964
Substrate/Competitorn/a
Meas. Tech.TR-FRET-based biochemical high throughput dose response assay to identify NR2E3 inverse agonists
IC50 2605±n/a nM
Citation PubChem, PC TR-FRET-based biochemical high throughput dose response assay to identify NR2E3 inverse agonists PubChem Bioassay(2010)[AID]
 
Photoreceptor-specific nuclear receptor
Name:Photoreceptor-specific nuclear receptor
Type:PROTEIN
Mol. Mass.:44699.83
Organism:Homo sapiens (Human)
Description:ChEMBL_401901
Residue:410
BDBM75964
NameBDBM75964
Synonyms:2-[[5-(1-benzofuran-2-yl)-4-methyl-1,2,4-triazol-3-yl]sulfanyl]-N-(3-fluorophenyl)acetamide 2-[[5-(2-benzofuranyl)-4-methyl-1,2,4-triazol-3-yl]thio]-N-(3-fluorophenyl)acetamide 2-{[5-(1-benzofuran-2-yl)-4-methyl-4H-1,2,4-triazol-3-yl]thio}-N-(3-fluorophenyl)acetamide SMR000079256 | cid_1262637
TypeSmall organic molecule
Emp. Form.C19H15FN4O2S
Mol. Mass.382.411
SMILESCn1c(SCC(=O)Nc2cccc(F)c2)nnc1-c1cc2ccccc2o1